�s���{���R�[�h���͎s�撬���R�[�h,NO,�s���{����,�s�撬����,����,����_�J�i,����_�ʏ�,POI�R�[�h,�Z��,����,�ܓx,�o�x,�d�b�ԍ�,�����ԍ�,�@�l�ԍ�,�c�̖�,���p�\�j��,�J�n����,�I������,���p�\�������L����,����,�o���A�t���[���,URL,���l,�X�֔ԍ�,�A�N�Z�X���@,���ԏ�_�L��,���ԏ���,����_�v��,����(��{),����(�ڍ�),���p����_�L��,���p����_�ڍ�,������_�L��,������_�ڍ�,�摜,�摜_���C�Z���X,�摜_�ڍ�,�ŏI�m�F��
132209,0000000001,�����s,����a�s,����a�s����,�q�K�V���}�g�V���N�V��,,1302a,����a�s����3-930,,35.745332,139.426299,042-563-2111,,,,���ΐ��؋��y,08:30,17:00,�y�j���͐��߂܂ŗ��p�\�B�����̏j���Ɋւ���@���ɋK�肷��x���E�N���N�n�i12��29�����痂�N1��3���j�͏I�����p�s�B,,����ł��g�C���L��G�����h�A�L��G�G���x�[�^�[�L��G�i�������G�_���u���b�N�L��G�萠��L��,https://www.city.higashiyamato.lg.jp,,207-8585,�����s�s���m���[���u��k��v�w�k���P�T��/�����o�X�E�s�c�o�X�u����a�s���������v���ԓk���R��/���傱�o�X�u����a�s�����v���Ԃ���,1,���O���ԏ�^8���`22���܂�,0,,,1,����a�s�����A���������ًy�ђ����}���ٗ��p�ҁA���̑������ꂽ���̂Ɍ���,0,,,,,2020-02-26
132209,0000000002,�����s,����a�s,��X������,�i���K�C�R�E�~���J��,,1307a,����a�s��X�T�|�R�Q,,35.737795,139.431285,042-564-2771,,,,���ΐ��؋��y,08:30,22:00,���T���j���A12/28�`1/4�͋x�ٓ��i�I�����p�s�j�B�J�َ��ԁ@�ߑO8��30������ߌ�10���܂Łi�w�K�����̗��p���ԁ@�ߑO9������ߌ�9��30���܂Łj,�w�K���A�H�쎺�A�W��A�a���A�ۈ玺�A�Ԃ����E�ӂ����,����ł��g�C���L��,"https://www.city.higashiyamato.lg.jp/index.cfm/35,854,369,html",,207-0014,�����q�����u����a�s�v�w�k���P�P��/�����o�X�E�s�c�o�X�u��X�����v���ԓk���T��/���傱�o�X�u��X�����v���ԓk���T��,1,,1,�H�쎺�i�Q�O�P�j�F�ߑO�i�X���`�P�Q���j�S�O�O�~�A�ߌ�i�P���`�T���j�T�O�O�~�A��ԁi�U���`�X���R�O���j�U�O�O�~�@�W��i�Q�O�Q�j�F�ߑO�U�O�O�~�A�ߌ�V�O�O�~�A��ԂW�O�O�~�@�w�K���i�Q�O�R�j�F�ߑO�S�O�O�~�A�ߌ�T�O�O�~�A��ԂU�O�O�~�@�w�K���i�Q�O�S�j�F�ߑO�S�O�O�~�A�ߌ�T�O�O�~�A��ԂU�O�O�~�@�a���i�Q�O�T�j�F�ߑO�S�O�O�~�A�ߌ�T�O�O�~�A��ԂU�O�O�~,�Љ��@��Q�O���ȊO�̖ړI�̂��߂Ɍ����ق��g�p����ꍇ�́A�g�p���𒥎�����B,1,���c����ړI�Ƃ��Ďg�p����ꍇ�A�@���c�̋y�я@���֌W�c�̂��z���A���U���̑�����ɗނ���s�ׂ𔺂����ƂŎg�p����ꍇ�A�s�O�̒c�̓��̊����Ɏg�p����ꍇ�i�������A�e�قْ̊������Ɏg�p�����F�����ꍇ�͏����j�́A�����ق̎g�p�����F���Ȃ��@�@�����w���ȉ��̎҂́A�ی�҂̓����Ȃ������ق��g�p���邱�Ƃ��ł��Ȃ�,0,,,,,2020-02-28
132209,0000000003,�����s,����a�s,����������,�`���E�I�E�R�E�~���J��,,1307a,����a�s�����R�|�X�Q�U,,35.744911,139.426384,042-564-2451,,,,���ΐ��؋��y,08:30,22:00,���T���j���A12/28�`1/4�͋x�ٓ��i�I�����p�s�j�B�J�َ��ԁ@�ߑO8��30������ߌ�10���܂Łi�w�K�����̗��p���ԁ@�ߑO9������ߌ�9��30���܂Łj,�z�[���A�����o���A���K���A�w�K���A�a���A�ۈ玺�A�Ԃ����E�ӂ����,����ł��g�C���L��,"https://www.city.higashiyamato.lg.jp/index.cfm/35,66975,369,html",,207-0015,�����s�s���m���[���u��k��v�w�k���P�T��/�����o�X�E�s�c�o�X�u����a�s���������v���ԓk���R��/���傱�o�X�u���������فE�}���فv���Ԃ���,1,�w�v����蒓�ԃ]�[���x�ݒu�B�`����l�H�֐߂��g�p���Ă�����A������Q���a�̕��A�D�P���̕��Ȃǂ����p�ΏہB,1,�z�[���F�ߑO�i�X���`�P�Q���j�T�C�T�O�O�~�A�ߌ�i�P���`�T���j�U�C�T�O�O�~�A��ԁi�U���`�X���R�O���j�V�C�T�O�O�~�@�����o���F�ߑO�T�O�O�~�A�ߌ�U�O�O�~�A��ԂV�O�O�~�@���K���F�ߑO�U�O�O�~�A�ߌ�V�O�O�~�A��ԂW�O�O�~�@�a���i�P�j�F�ߑO�S�O�O�~�A�ߌ�T�O�O�~�A��ԂU�O�O�~�@�a���i�Q�j�F�ߑO�S�O�O�~�A�ߌ�T�O�O�~�A��ԂU�O�O�~�@�w�K���i�Q�O�P�j�F�ߑO�S�O�O�~�A�ߌ�T�O�O�~�A��ԂU�O�O�~�@�w�K���i�Q�O�Q�j�F�ߑO�R�O�O�~�A�ߌ�S�O�O�~�A�ߌ�T�O�O�~�@�w�K���i�Q�O�R�j�F�ߑO�S�O�O�~�A�ߌ�T�O�O�~�A��ԂU�O�O�~�@�w�K���i�Q�O�S�j�F�ߑO�R�O�O�~�A�ߌ�S�O�O�~�A��ԂT�O�O�~�@�w�K���i�R�O�P�j�F�ߑO�S�O�O�~�A�ߌ�T�O�O�~�A��ԂU�O�O�~�@�w�K���i�R�O�Q�j�F�ߑO�R�O�O�~�A�ߌ�S�O�O�~�A��ԂT�O�O�~,�Љ��@��Q�O���ȊO�̖ړI�̂��߂Ɍ����ق��g�p����ꍇ�́A�g�p���𒥎�����B,1,���c����ړI�Ƃ��Ďg�p����ꍇ�A�@���c�̋y�я@���֌W�c�̂��z���A���U���̑�����ɗނ���s�ׂ𔺂����ƂŎg�p����ꍇ�A�s�O�̒c�̓��̊����Ɏg�p����ꍇ�i�������A�e�قْ̊������Ɏg�p�����F�����ꍇ�͏����j�́A�����ق̎g�p�����F���Ȃ��@�@�����w���ȉ��̎҂́A�ی�҂̓����Ȃ������ق��g�p���邱�Ƃ��ł��Ȃ��@�@�����Z���́A�ی�҂̓����Ȃ����������كz�[�����g�p���邱�Ƃ��ł��Ȃ�,0,,,,,2020-02-28
132209,0000000004,�����s,����a�s,���R������,�T���}�R�E�~���J��,,1307a,����a�s���R�R�|�P�R�S�S�|�P,,35.756086,139.437632,042-565-2700,,,,���ΐ��؋��y,08:30,22:00,���T���j���A12/28�`1/4�͋x�ٓ��i�I�����p�s�j�B�J�َ��ԁ@�ߑO8��30������ߌ�10���܂Łi�w�K�����̗��p���ԁ@�ߑO9������ߌ�9��30���܂Łj,�w�K���A�a���A�}�����A�Ԃ����E�ӂ����,����ł��g�C���L��,"https://www.city.higashiyamato.lg.jp/index.cfm/35,852,369,html",,207-0003,���������ΐ��u������a�v�w�k���W��/�����o�X�u���R�O���ځv�܂��́u���ؓ񒚖ځv���ԓk���T��/���傱�o�X�u��܂Ɖ��v���ԓk���T��,1,,1,�w�K���i�P�O�P�j�F�ߑO�i�X���`�P�Q���j�U�O�O�~�A�ߌ�i�P���`�T���j�V�O�O�~�A��ԁi�U���`�X���R�O���j�W�O�O�~�@�w�K���i�Q�O�P�j�F�ߑO�S�O�O�~�A�ߌ�T�O�O�~�A��ԂU�O�O�~�@�w�K���i�Q�O�Q�j�F�ߑO�R�O�O�~�A�ߌ�S�O�O�~�A��ԂT�O�O�~�@�a���P�F�ߑO�i�X���`�P�Q���j�S�O�O�~�A�ߌ�i�P���`�T���j�T�O�O�~�A��ԁi�U���`�X���R�O���j�U�O�O�~�@�a���Q�F�ߑO�i�X���`�P�Q���j�S�O�O�~�A�ߌ�i�P���`�T���j�T�O�O�~�A��ԁi�U���`�X���R�O���j�U�O�O�~,�Љ��@��Q�O���ȊO�̖ړI�̂��߂Ɍ����ق��g�p����ꍇ�́A�g�p���𒥎�����B,1,���c����ړI�Ƃ��Ďg�p����ꍇ�A�@���c�̋y�я@���֌W�c�̂��z���A���U���̑�����ɗނ���s�ׂ𔺂����ƂŎg�p����ꍇ�A�s�O�̒c�̓��̊����Ɏg�p����ꍇ�i�������A�e�قْ̊������Ɏg�p�����F�����ꍇ�͏����j�́A�����ق̎g�p�����F���Ȃ��@�@�����w���ȉ��̎҂́A�ی�҂̓����Ȃ������ق��g�p���邱�Ƃ��ł��Ȃ�,0,,,,,2020-02-28
132209,0000000005,�����s,����a�s,���~������,�]�E�V�L�R�E�~���J��,,1307a,����a�s���~�Q�|�R�R�V,,35.754477,139.416201,042-566-0551,,,,���ΐ��؋��y,08:30,22:00,���T���j���A12/28�`1/4�͋x�ٓ��i�I�����p�s�j�B�J�َ��ԁ@�ߑO8��30������ߌ�10���܂Łi�w�K�����̗��p���ԁ@�ߑO9������ߌ�9��30���܂Łj,�w�K���A�a���A�}�����A�Ԃ����E�ӂ����,����ł��g�C���L��,"https://www.city.higashiyamato.lg.jp/index.cfm/35,81759,369,html",,207-0032,�����q�����u����a�s�v�w���琼���o�X�E�s�c�o�X�u���E�v����100���[�g��/�����s�s���m���[���u��k��v�w����900���[�g��,1,�P�R��,1,�w�K���i�P�O�P�j�F�ߑO�i�X���`�P�Q���j�U�O�O�~�A�ߌ�i�P���`�T���j�V�O�O�~�A��ԁi�U���`�X���R�O���j�W�O�O�~�@�a���F�ߑO�S�O�O�~�A�ߌ�T�O�O�~�A��ԂU�O�O�~�@�w�K���i�Q�O�P�j�F�ߑO�S�O�O�~�A�ߌ�T�O�O�~�A��ԂU�O�O�~�@�w�K���i�Q�O�Q�j�F�ߑO�R�O�O�~�A�ߌ�S�O�O�~�A��ԂT�O�O�~,�Љ��@��Q�O���ȊO�̖ړI�̂��߂Ɍ����ق��g�p����ꍇ�́A�g�p���𒥎�����B,1,���c����ړI�Ƃ��Ďg�p����ꍇ�A�@���c�̋y�я@���֌W�c�̂��z���A���U���̑�����ɗނ���s�ׂ𔺂����ƂŎg�p����ꍇ�A�s�O�̒c�̓��̊����Ɏg�p����ꍇ�i�������A�e�قْ̊������Ɏg�p�����F�����ꍇ�͏����j�́A�����ق̎g�p�����F���Ȃ��@�@�����w���ȉ��̎҂́A�ی�҂̓����Ȃ������ق��g�p���邱�Ƃ��ł��Ȃ�,0,,,,,2020-02-28
132209,0000000006,�����s,����a�s,��k�������,�J�~�L�^�_�C�R�E�~���J��,,1307a,����a�s��k��Q�|�W�U�T�|�X,,35.743098,139.414718,042-567-2691,,,,���ΐ��؋��y,08:30,22:00,���T���j���A12/28�`1/4�͋x�ٓ��i�I�����p�s�j�B�J�َ��ԁ@�ߑO8��30������ߌ�10���܂Łi�w�K�����̗��p���ԁ@�ߑO9������ߌ�9��30���܂Łj,�w�K���A�a���A�ۈ玺�A�Ԃ����E�ӂ����,����ł��g�C���L��,"https://www.city.higashiyamato.lg.jp/index.cfm/35,853,369,html",,207-0023,�����s�s���m���[���u��k��v�w�k���P�O��/���傱�o�X�u��k��c�n���v���ԓk���Q��,1,,1,�W��i�R�O�P�j�F�ߑO�i�X���`�P�Q���j�U�O�O�~�A�ߌ�i�P���`�T���j�V�O�O�~�A��ԁi�U���`�X���R�O���j�W�O�O�~�@�w�K���i�R�O�Q�j�F�ߑO�S�O�O�~�A�ߌ�T�O�O�~�A��ԂU�O�O�~�@�w�K���i�R�O�R�j�F�ߑO�S�O�O�~�A�ߌ�T�O�O�~�A��ԂU�O�O�~�@�w�K���i�R�O�S�j�F�ߑO�S�O�O�~�A�ߌ�T�O�O�~�A��ԂU�O�O�~�@�a���i�R�O�T�j�F�ߑO�S�O�O�~�A�ߌ�T�O�O�~�A��ԂU�O�O�~,�Љ��@��Q�O���ȊO�̖ړI�̂��߂Ɍ����ق��g�p����ꍇ�́A�g�p���𒥎�����B,1,���c����ړI�Ƃ��Ďg�p����ꍇ�A�@���c�̋y�я@���֌W�c�̂��z���A���U���̑�����ɗނ���s�ׂ𔺂����ƂŎg�p����ꍇ�A�s�O�̒c�̓��̊����Ɏg�p����ꍇ�i�������A�e�قْ̊������Ɏg�p�����F�����ꍇ�͏����j�́A�����ق̎g�p�����F���Ȃ��@�@�����w���ȉ��̎҂́A�ی�҂̓����Ȃ������ق��g�p���邱�Ƃ��ł��Ȃ�,0,,,,,2020-02-28
132209,0000000007,�����s,����a�s,�����}����,�`���E�I�E�g�V���J��,,1512a,����a�s�����R�|�X�R�O,,35.744916,139.42699,042-564-2454,,,,�������؋��y,10:00,17:00,�x�ٓ��@��R�ؗj���E�j���i�y���Əd�Ȃ����ꍇ�͊J�فj�E�N���N�n�E���ʎ����������ԁB��ʊJ�ˎ��A�����J�ˎ��@���؋��j����19���܂ŊJ�فB,��ʊJ�ˁA�����J�ˁA���͂Ȃ��̂ւ�A�ΖʘN�ǎ��A�����o���A��c���A�Q�l�������A�Ԃ����E�ӂ����,,http://www.lib.higashiyamato.tokyo.jp/contents/library/kakukan.html,,207-0015,�����q�����u����a�s�v�w�EJR�u����v�w���琼���o�X�E�s�c�o�X�u����a�s���������v���ԓk���R��/�����V�h���u�����R�v�w���琼���o�X�u����a�s���������v���ԓk���R��/���傱�o�X�u����a�s�����v���ԓk���R��,,,,,,,,,,,,,2020-02-27
132209,0000000008,�����s,����a�s,�����u�}����,�T�N���K�I�J�g�V���J��,,1512a,����a�s�����u�R�|�S�S�|�P�R,,35.734092,139.419935,042-567-2231,,,,�������؋��y,10:00,17:00,�x�ٓ��@��R�ؗj���E�j���i�y���Əd�Ȃ����ꍇ�͊J�فj�E�N���N�n�E���ʎ�����������,��ʊJ�ˁA�����J��,,http://www.lib.higashiyamato.tokyo.jp/contents/library/kakukan.html,,207-0022,�����q�����E�����s�s���m���[���u�ʐ�㐅�v�w�k���T��/���傱�o�X�u���������Z���^�[�u�́[�Ƃӂ�v�v���ԓk���P��,,,,,,,,,,,,,2020-02-27
132209,0000000009,�����s,����a�s,�����}����,�L���n���g�V���J��,,1512a,����a�s�����S�|�P,,35.742769,139.446976,042-564-2944,,,,�����؋��y,10:00,17:00,�x�ٓ��@��R�ؗj���E�j���i�y���Əd�Ȃ����ꍇ�͊J�فj�E�N���N�n�E���ʎ�����������,��ʊJ�ˁA�����J�ˁA���b�����ΖʘN�ǎ��A�Ԃ����E�ӂ����,,http://www.lib.higashiyamato.tokyo.jp/contents/library/kakukan.html,,207-0011,�����q�����u����a�s�v�w�EJR�u����v�w���琼���o�X�u�c�n��v���ԓk���P��,,,,,,,,,,,,,2020-02-27
132209,0000000010,�����s,����a�s,�ނ����͂玙����,���R�E�n���W�h�E�J��,,1403a,����a�s�����R�|�P�O,,35.740581,139.436707,042-563-1858,,,,���ΐ��؋��y,10:00,17:00,�j���A12/28�`1/3�͏I�����p�s�B�s�����̓s���ŋx�قƂȂ�ꍇ������B���w���ȏ�18�Ζ����̗��p�҂͌ߌ�6���܂ŗ��p�B,�v���C���[���A�}�����A�c����,,"https://www.city.higashiyamato.lg.jp/index.cfm/33,0,346,601,html",,207-0013,�����q�����u����a�s�v�w�k���P�T��/�����o�X�E�s�c�o�X�u��X�����v���ԓk���P�O��/���傱�o�X�u�s�c�����A�p�[�g�v���ԓk���T��,,,,,,,,,,,,,2020-02-17
132209,0000000011,�����s,����a�s,����͂玙����,�L���n���W�h�E�J��,,1403a,����a�s�����Q�|�P,,35.743172,139.446909,042-565-6021,,,,���ΐ��؋��y,10:00,17:00,�j���A12/28�`1/3�͏I�����p�s�B�s�����̓s���ŋx�قƂȂ�ꍇ������B���j���͌ߌ�0�����痘�p�B���w���ȏ�18�Ζ����̗��p�҂͌ߌ�6���܂ŗ��p�B,�v���C���[���A�N���t�g���[���A�}�����A���т������[��,,"https://www.city.higashiyamato.lg.jp/index.cfm/33,0,346,602,html",,207-0011,�����q�����u����a�s�v�w���琼���o�X�u�c�n�k�v���ԓk���R��/���傱�o�X�u�����Z���ځv���ԓk���U��,0,��Q�Ҏԗ��͏���,,,,,,,,,,,2020-02-17
132209,0000000012,�����s,����a�s,�Ȃ�͂�������,�i���n�V�W�h�E�J��,,1403a,����a�s�ޗǋ��S�|�U�O�O,,35.752485,139.42576,042-562-3600,,,,���ΐ��؋��y,10:00,17:00,�j���A12/28�`1/3�͏I�����p�s�B�s�����̓s���ŋx�قƂȂ�ꍇ������B���w���ȏ�18�Ζ����̗��p�҂͌ߌ�6���܂ŗ��p�B,�v���C���[���A�}�����A�W�,,"https://www.city.higashiyamato.lg.jp/index.cfm/33,0,346,603,html",,207-0031,�����q�����u����a�s�v�w���琼���o�X�u�ޗǋ��v���ԓk���Q��/���傱�o�X�u�ޗǋ��s���Z���^�[�v���ԓk���O��,,,,,,,,,,,,,2020-02-17
132209,0000000013,�����s,����a�s,�Ȃ񂪂�������,�i���K�C�W�h�E�J��,,1403a,����a�s��X�T�|�R�Q,,35.737142,139.4315,042-567-2441,,,,���ΐ��؋��y,10:00,17:00,�j���A12/28�`1/3�͏I�����p�s�B�s�����̓s���ŋx�قƂȂ�ꍇ������B���w���ȏ�18�Ζ����̗��p�҂͌ߌ�6���܂ŗ��p�B,�v���C���[���A�}����,,"https://www.city.higashiyamato.lg.jp/index.cfm/33,0,346,605,html",,207-0014,�����q�����u����a�s�v�w�k���P�P��/�����o�X�E�s�c�o�X�u��X�����v���ԓk���T��/���傱�o�X�u��X�����v���ԓk���T��,,,,,,,,,,,,,2020-02-17
132209,0000000014,�����s,����a�s,���݂�������������,�J�~�L�^�_�C�W�h�E�J��,,1403a,����a�s��k��Q�|�W�U�T�|�X,,35.742882,139.414742,042-567-2884,,,,���ΐ��؋��y,10:00,17:00,�j���A12/28�`1/3�͏I�����p�s�B�s�����̓s���ŋx�قƂȂ�ꍇ������B���w���ȏ�18�Ζ����̗��p�҂͌ߌ�6���܂ŗ��p�B,�v���C���[���A�}�����A�c����,,"https://www.city.higashiyamato.lg.jp/index.cfm/33,0,346,604,html",,207-0023,�����s�s���m���[���u��k��v�w�k���P�O��/���傱�o�X�u��k��c�n���v���ԓk���Q��,,,,,,,,,,,,,2020-02-17
132209,0000000015,�����s,����a�s,�����炪����������,�T�N���K�I�J�W�h�E�J��,,1403a,����a�s�����u�R�|�S�S�|�P�R,,35.734404,139.420337,042-567-2237,,,,���ΐ��؋��y,10:00,17:00,�j���A12/28�`1/3�͏I�����p�s�B�s�����̓s���ŋx�قƂȂ�ꍇ������B���w���ȏ�18�Ζ����̗��p�҂͌ߌ�6���܂ŗ��p�B,�v���C���[���A�L�b�Y���[��,,"https://www.city.higashiyamato.lg.jp/index.cfm/33,0,346,606,html",,207-0022,�����q�����E�����s�s���m���[���u�ʐ�㐅�v�w�k���V��,0,��Q�Ҏԗ��͏���,,,,,,,,,,,2020-02-17
132209,0000000016,�����s,����a�s,�w���ۈ珊���N���u,�K�N�h�E�z�C�N�V���_�C�C�`�N���u,,1404a,����a�s�ޗǋ��S�|�U�O�O,,35.752485,139.42576,042-565-7373,,,,���ΐ��؋��y,,19:00,����a�s�����w�Z�̎��Ɠ��F���Z������B����a�s�����w�Z�̋x�Ɠ��i�y�j���y�ђ����x�Ɠ��A�U�֋x���j�F�ߑO�W������B�ߌ�6������ߌ�7���͉����ۈ�B�j���A12/29�`1/3�͏I�����p�s�B,���ی�ɂ����ĕی�҂̎d����a�C���̗��R�ɂ���ĕی�҂̓K�؂ȊČ���󂯂��Ȃ����w�Z�ɏA�w���Ă��鎙���̈��S�m�ۋy�ь��S�琬��}�邱�Ƃ�ړI�Ƃ��Ă���B,,"https://www.city.higashiyamato.lg.jp/index.cfm/33,94383,345,599,html",,207-0031,�����q�����u����a�s�v�w���琼���o�X�u�ޗǋ��v���ԓk���Q��/���傱�o�X�u�ޗǋ��s���Z���^�[�v���ԓk���O��,,,1,"�琬���F���z4,500�~�A�ԐH��F���z1,500�~","�����琬���F���z2,500�~�A1�����p500�~�A�琬�����A�ԐH��̌��Ɛ��x����B",1,�����F1.�s���ɋ��Z���Ă��菬�w�Z�ɏA�w���Ă��鎙���@2.�S�g�ɏ�Q��L���鎙���ɂ��Ắu���̎蒠�v3�x�Ⴕ����4�x�܂��́u�g�̏�Q�Ҏ蒠�v5������7���܂ł̎����A�܂��́A�����Ɠ����x�ƔF�߂��鎙���ŏW�c�������c�ނ��Ƃ��ł��A���A���͂Œʏ����邱�Ƃ��ł��鎙���B�@�ی�ҁF�J���E���a�E��Q�E�ЊQ�E���E�o�Y�E�A�w���̗��R�ɂ��A���ԉƒ�ɂ����Ă��q����̓K�؂ȊČ�ɓ�����Ȃ��ꍇ�ɑΏۂƂȂ�B�J���ɂ��ꍇ�Ƃ́A����13���ȏ��1��������4���Ԉȏ�̘J�������Ă���ꍇ�������B���玙�x�ƒ��́A�������悤�Ƃ��錎�̗����̏����܂łɕ��E����ꍇ�Ɍ���B,,,,,,2020-02-17
132209,0000000017,�����s,����a�s,�w���ۈ珊���N���u,�K�N�h�E�z�C�N�V���_�C�j�N���u,,1404a,����a�s��X�T�|�R�Q,,35.737142,139.4315,042-564-6176,,,,���ΐ��؋��y,,19:00,����a�s�����w�Z�̎��Ɠ��F���Z������B����a�s�����w�Z�̋x�Ɠ��i�y�j���y�ђ����x�Ɠ��A�U�֋x���j�F�ߑO�W������B�ߌ�6������ߌ�7���͉����ۈ�B�j���A12/29�`1/3�͏I�����p�s�B,���ی�ɂ����ĕی�҂̎d����a�C���̗��R�ɂ���ĕی�҂̓K�؂ȊČ���󂯂��Ȃ����w�Z�ɏA�w���Ă��鎙���̈��S�m�ۋy�ь��S�琬��}�邱�Ƃ�ړI�Ƃ��Ă���B,,"https://www.city.higashiyamato.lg.jp/index.cfm/33,94383,345,599,html",,207-0014,�����q�����u����a�s�v�w�k���P�P��/�����o�X�E�s�c�o�X�u��X�����v���ԓk���T��/���傱�o�X�u��X�����v���ԓk���T��,,,1,"�琬���F���z4,500�~�A�ԐH��F���z1,500�~","�����琬���F���z2,500�~�A1�����p500�~�A�琬�����A�ԐH��̌��Ɛ��x����B",1,�����F1.�s���ɋ��Z���Ă��菬�w�Z�ɏA�w���Ă��鎙���@2.�S�g�ɏ�Q��L���鎙���ɂ��Ắu���̎蒠�v3�x�Ⴕ����4�x�܂��́u�g�̏�Q�Ҏ蒠�v5������7���܂ł̎����A�܂��́A�����Ɠ����x�ƔF�߂��鎙���ŏW�c�������c�ނ��Ƃ��ł��A���A���͂Œʏ����邱�Ƃ��ł��鎙���B�@�ی�ҁF�J���E���a�E��Q�E�ЊQ�E���E�o�Y�E�A�w���̗��R�ɂ��A���ԉƒ�ɂ����Ă��q����̓K�؂ȊČ�ɓ�����Ȃ��ꍇ�ɑΏۂƂȂ�B�J���ɂ��ꍇ�Ƃ́A����13���ȏ��1��������4���Ԉȏ�̘J�������Ă���ꍇ�������B���玙�x�ƒ��́A�������悤�Ƃ��錎�̗����̏����܂łɕ��E����ꍇ�Ɍ���B,,,,,,2020-02-17
132209,0000000018,�����s,����a�s,�w���ۈ珊��O�N���u,�K�N�h�E�z�C�N�V���_�C�T���N���u,,1404a,����a�s�����Q�|�P,,35.743172,139.446909,042-561-1180,,,,���ΐ��؋��y,,19:00,����a�s�����w�Z�̎��Ɠ��F���Z������B����a�s�����w�Z�̋x�Ɠ��i�y�j���y�ђ����x�Ɠ��A�U�֋x���j�F�ߑO�W������B�ߌ�6������ߌ�7���͉����ۈ�B�j���A12/29�`1/3�͏I�����p�s�B,���ی�ɂ����ĕی�҂̎d����a�C���̗��R�ɂ���ĕی�҂̓K�؂ȊČ���󂯂��Ȃ����w�Z�ɏA�w���Ă��鎙���̈��S�m�ۋy�ь��S�琬��}�邱�Ƃ�ړI�Ƃ��Ă���B,,"https://www.city.higashiyamato.lg.jp/index.cfm/33,94383,345,599,html",,207-0011,�����q�����u����a�s�v�w���琼���o�X�u�c�n�k�v���ԓk���R��/���傱�o�X�u�����Z���ځv���ԓk���U��,,,1,"�琬���F���z4,500�~�A�ԐH��F���z1,500�~","�����琬���F���z2,500�~�A1�����p500�~�A�琬�����A�ԐH��̌��Ɛ��x����B",1,�����F1.�s���ɋ��Z���Ă��菬�w�Z�ɏA�w���Ă��鎙���@2.�S�g�ɏ�Q��L���鎙���ɂ��Ắu���̎蒠�v3�x�Ⴕ����4�x�܂��́u�g�̏�Q�Ҏ蒠�v5������7���܂ł̎����A�܂��́A�����Ɠ����x�ƔF�߂��鎙���ŏW�c�������c�ނ��Ƃ��ł��A���A���͂Œʏ����邱�Ƃ��ł��鎙���B�@�ی�ҁF�J���E���a�E��Q�E�ЊQ�E���E�o�Y�E�A�w���̗��R�ɂ��A���ԉƒ�ɂ����Ă��q����̓K�؂ȊČ�ɓ�����Ȃ��ꍇ�ɑΏۂƂȂ�B�J���ɂ��ꍇ�Ƃ́A����13���ȏ��1��������4���Ԉȏ�̘J�������Ă���ꍇ�������B���玙�x�ƒ��́A�������悤�Ƃ��錎�̗����̏����܂łɕ��E����ꍇ�Ɍ���B,,,,,,2020-02-17
132209,0000000019,�����s,����a�s,�w���ۈ珊��l�N���u,�K�N�h�E�z�C�N�V���_�C�����N���u,,1404a,����a�s���R�T�|�P�O�T�S�|�P,,35.748683,139.441445,042-564-2660,,,,���ΐ��؋��y,,19:00,����a�s�����w�Z�̎��Ɠ��F���Z������B����a�s�����w�Z�̋x�Ɠ��i�y�j���y�ђ����x�Ɠ��A�U�֋x���j�F�ߑO�W������B�ߌ�6������ߌ�7���͉����ۈ�B�j���A12/29�`1/3�͏I�����p�s�B,���ی�ɂ����ĕی�҂̎d����a�C���̗��R�ɂ���ĕی�҂̓K�؂ȊČ���󂯂��Ȃ����w�Z�ɏA�w���Ă��鎙���̈��S�m�ۋy�ь��S�琬��}�邱�Ƃ�ړI�Ƃ��Ă���B,,"https://www.city.higashiyamato.lg.jp/index.cfm/33,94383,345,599,html",,207-0003,,,,1,"�琬���F���z4,500�~�A�ԐH��F���z1,500�~","�����琬���F���z2,500�~�A1�����p500�~�A�琬�����A�ԐH��̌��Ɛ��x����B",1,�����F1.�s���ɋ��Z���Ă��菬�w�Z�ɏA�w���Ă��鎙���@2.�S�g�ɏ�Q��L���鎙���ɂ��Ắu���̎蒠�v3�x�Ⴕ����4�x�܂��́u�g�̏�Q�Ҏ蒠�v5������7���܂ł̎����A�܂��́A�����Ɠ����x�ƔF�߂��鎙���ŏW�c�������c�ނ��Ƃ��ł��A���A���͂Œʏ����邱�Ƃ��ł��鎙���B�@�ی�ҁF�J���E���a�E��Q�E�ЊQ�E���E�o�Y�E�A�w���̗��R�ɂ��A���ԉƒ�ɂ����Ă��q����̓K�؂ȊČ�ɓ�����Ȃ��ꍇ�ɑΏۂƂȂ�B�J���ɂ��ꍇ�Ƃ́A����13���ȏ��1��������4���Ԉȏ�̘J�������Ă���ꍇ�������B���玙�x�ƒ��́A�������悤�Ƃ��錎�̗����̏����܂łɕ��E����ꍇ�Ɍ���B,,,,,,2020-02-17
132209,0000000020,�����s,����a�s,�w���ۈ珊��܃N���u,�K�N�h�E�z�C�N�V���_�C�S�N���u,,1404a,����a�s�����R�|�P�O,,35.740581,139.436707,042-565-4140,,,,���ΐ��؋��y,,19:00,����a�s�����w�Z�̎��Ɠ��F���Z������B����a�s�����w�Z�̋x�Ɠ��i�y�j���y�ђ����x�Ɠ��A�U�֋x���j�F�ߑO�W������B�ߌ�6������ߌ�7���͉����ۈ�B�j���A12/29�`1/3�͏I�����p�s�B,���ی�ɂ����ĕی�҂̎d����a�C���̗��R�ɂ���ĕی�҂̓K�؂ȊČ���󂯂��Ȃ����w�Z�ɏA�w���Ă��鎙���̈��S�m�ۋy�ь��S�琬��}�邱�Ƃ�ړI�Ƃ��Ă���B,,"https://www.city.higashiyamato.lg.jp/index.cfm/33,94383,345,599,html",,207-0013,�����q�����u����a�s�v�w�k���P�T��/�����o�X�E�s�c�o�X�u��X�����v���ԓk���P�O��/���傱�o�X�u�s�c�����A�p�[�g�v���ԓk���T��,,,1,"�琬���F���z4,500�~�A�ԐH��F���z1,500�~","�����琬���F���z2,500�~�A1�����p500�~�A�琬�����A�ԐH��̌��Ɛ��x����B",1,�����F1.�s���ɋ��Z���Ă��菬�w�Z�ɏA�w���Ă��鎙���@2.�S�g�ɏ�Q��L���鎙���ɂ��Ắu���̎蒠�v3�x�Ⴕ����4�x�܂��́u�g�̏�Q�Ҏ蒠�v5������7���܂ł̎����A�܂��́A�����Ɠ����x�ƔF�߂��鎙���ŏW�c�������c�ނ��Ƃ��ł��A���A���͂Œʏ����邱�Ƃ��ł��鎙���B�@�ی�ҁF�J���E���a�E��Q�E�ЊQ�E���E�o�Y�E�A�w���̗��R�ɂ��A���ԉƒ�ɂ����Ă��q����̓K�؂ȊČ�ɓ�����Ȃ��ꍇ�ɑΏۂƂȂ�B�J���ɂ��ꍇ�Ƃ́A����13���ȏ��1��������4���Ԉȏ�̘J�������Ă���ꍇ�������B���玙�x�ƒ��́A�������悤�Ƃ��錎�̗����̏����܂łɕ��E����ꍇ�Ɍ���B,,,,,,2020-02-17
132209,0000000021,�����s,����a�s,�w���ۈ珊��Z�N���u,�K�N�h�E�z�C�N�V���_�C���N�N���u,,1404a,����a�s�����Q�|�P,,35.743172,139.446909,042-564-9794,,,,���ΐ��؋��y,,19:00,����a�s�����w�Z�̎��Ɠ��F���Z������B����a�s�����w�Z�̋x�Ɠ��i�y�j���y�ђ����x�Ɠ��A�U�֋x���j�F�ߑO�W������B�ߌ�6������ߌ�7���͉����ۈ�B�j���A12/29�`1/3�͏I�����p�s�B,���ی�ɂ����ĕی�҂̎d����a�C���̗��R�ɂ���ĕی�҂̓K�؂ȊČ���󂯂��Ȃ����w�Z�ɏA�w���Ă��鎙���̈��S�m�ۋy�ь��S�琬��}�邱�Ƃ�ړI�Ƃ��Ă���B,,"https://www.city.higashiyamato.lg.jp/index.cfm/33,94383,345,599,html",,207-0011,�����q�����u����a�s�v�w���琼���o�X�u�c�n�k�v���ԓk���R��/���傱�o�X�u�����Z���ځv���ԓk���U��,,,1,"�琬���F���z4,500�~�A�ԐH��F���z1,500�~","�����琬���F���z2,500�~�A1�����p500�~�A�琬�����A�ԐH��̌��Ɛ��x����B",1,�����F1.�s���ɋ��Z���Ă��菬�w�Z�ɏA�w���Ă��鎙���@2.�S�g�ɏ�Q��L���鎙���ɂ��Ắu���̎蒠�v3�x�Ⴕ����4�x�܂��́u�g�̏�Q�Ҏ蒠�v5������7���܂ł̎����A�܂��́A�����Ɠ����x�ƔF�߂��鎙���ŏW�c�������c�ނ��Ƃ��ł��A���A���͂Œʏ����邱�Ƃ��ł��鎙���B�@�ی�ҁF�J���E���a�E��Q�E�ЊQ�E���E�o�Y�E�A�w���̗��R�ɂ��A���ԉƒ�ɂ����Ă��q����̓K�؂ȊČ�ɓ�����Ȃ��ꍇ�ɑΏۂƂȂ�B�J���ɂ��ꍇ�Ƃ́A����13���ȏ��1��������4���Ԉȏ�̘J�������Ă���ꍇ�������B���玙�x�ƒ��́A�������悤�Ƃ��錎�̗����̏����܂łɕ��E����ꍇ�Ɍ���B,,,,,,2020-02-17
132209,0000000022,�����s,����a�s,�w���ۈ珊�掵�N���u,�K�N�h�E�z�C�N�V���_�C�i�i�N���u,,1404a,����a�s���E�T�|�P�P�W�R�|�P,,35.750249,139.415658,042-565-4114,,,,���ΐ��؋��y,,19:00,����a�s�����w�Z�̎��Ɠ��F���Z������B����a�s�����w�Z�̋x�Ɠ��i�y�j���y�ђ����x�Ɠ��A�U�֋x���j�F�ߑO�W������B�ߌ�6������ߌ�7���͉����ۈ�B�j���A12/29�`1/3�͏I�����p�s�B,���ی�ɂ����ĕی�҂̎d����a�C���̗��R�ɂ���ĕی�҂̓K�؂ȊČ���󂯂��Ȃ����w�Z�ɏA�w���Ă��鎙���̈��S�m�ۋy�ь��S�琬��}�邱�Ƃ�ړI�Ƃ��Ă���B,,"https://www.city.higashiyamato.lg.jp/index.cfm/33,94383,345,599,html",,207-0033,,,,1,"�琬���F���z4,500�~�A�ԐH��F���z1,500�~","�����琬���F���z2,500�~�A1�����p500�~�A�琬�����A�ԐH��̌��Ɛ��x����B",1,�����F1.�s���ɋ��Z���Ă��菬�w�Z�ɏA�w���Ă��鎙���@2.�S�g�ɏ�Q��L���鎙���ɂ��Ắu���̎蒠�v3�x�Ⴕ����4�x�܂��́u�g�̏�Q�Ҏ蒠�v5������7���܂ł̎����A�܂��́A�����Ɠ����x�ƔF�߂��鎙���ŏW�c�������c�ނ��Ƃ��ł��A���A���͂Œʏ����邱�Ƃ��ł��鎙���B�@�ی�ҁF�J���E���a�E��Q�E�ЊQ�E���E�o�Y�E�A�w���̗��R�ɂ��A���ԉƒ�ɂ����Ă��q����̓K�؂ȊČ�ɓ�����Ȃ��ꍇ�ɑΏۂƂȂ�B�J���ɂ��ꍇ�Ƃ́A����13���ȏ��1��������4���Ԉȏ�̘J�������Ă���ꍇ�������B���玙�x�ƒ��́A�������悤�Ƃ��錎�̗����̏����܂łɕ��E����ꍇ�Ɍ���B,,,,,,2020-02-17
132209,0000000023,�����s,����a�s,�w���ۈ珊�攪�N���u,�K�N�h�E�z�C�N�V���_�C�n�`�N���u,,1404a,����a�s����R�|�P�Q�S�U�|�P,,35.741798,139.421905,042-565-8003,,,,���ΐ��؋��y,,19:00,����a�s�����w�Z�̎��Ɠ��F���Z������B����a�s�����w�Z�̋x�Ɠ��i�y�j���y�ђ����x�Ɠ��A�U�֋x���j�F�ߑO�W������B�ߌ�6������ߌ�7���͉����ۈ�B�j���A12/29�`1/3�͏I�����p�s�B,���ی�ɂ����ĕی�҂̎d����a�C���̗��R�ɂ���ĕی�҂̓K�؂ȊČ���󂯂��Ȃ����w�Z�ɏA�w���Ă��鎙���̈��S�m�ۋy�ь��S�琬��}�邱�Ƃ�ړI�Ƃ��Ă���B,,"https://www.city.higashiyamato.lg.jp/index.cfm/33,94383,345,599,html",,207-0021,,,,1,"�琬���F���z4,500�~�A�ԐH��F���z1,500�~","�����琬���F���z2,500�~�A1�����p500�~�A�琬�����A�ԐH��̌��Ɛ��x����B",1,�����F1.�s���ɋ��Z���Ă��菬�w�Z�ɏA�w���Ă��鎙���@2.�S�g�ɏ�Q��L���鎙���ɂ��Ắu���̎蒠�v3�x�Ⴕ����4�x�܂��́u�g�̏�Q�Ҏ蒠�v5������7���܂ł̎����A�܂��́A�����Ɠ����x�ƔF�߂��鎙���ŏW�c�������c�ނ��Ƃ��ł��A���A���͂Œʏ����邱�Ƃ��ł��鎙���B�@�ی�ҁF�J���E���a�E��Q�E�ЊQ�E���E�o�Y�E�A�w���̗��R�ɂ��A���ԉƒ�ɂ����Ă��q����̓K�؂ȊČ�ɓ�����Ȃ��ꍇ�ɑΏۂƂȂ�B�J���ɂ��ꍇ�Ƃ́A����13���ȏ��1��������4���Ԉȏ�̘J�������Ă���ꍇ�������B���玙�x�ƒ��́A�������悤�Ƃ��錎�̗����̏����܂łɕ��E����ꍇ�Ɍ���B,,,,,,2020-02-17
132209,0000000024,�����s,����a�s,�w���ۈ珊���N���u,�K�N�h�E�z�C�N�V���_�C�L���E�N���u,,1404a,����a�s���~�Q�|�T�S�U,,35.751715,139.420308,042-564-9745,,,,���ΐ��؋��y,,19:00,����a�s�����w�Z�̎��Ɠ��F���Z������B����a�s�����w�Z�̋x�Ɠ��i�y�j���y�ђ����x�Ɠ��A�U�֋x���j�F�ߑO�W������B�ߌ�6������ߌ�7���͉����ۈ�B�j���A12/29�`1/3�͏I�����p�s�B,���ی�ɂ����ĕی�҂̎d����a�C���̗��R�ɂ���ĕی�҂̓K�؂ȊČ���󂯂��Ȃ����w�Z�ɏA�w���Ă��鎙���̈��S�m�ۋy�ь��S�琬��}�邱�Ƃ�ړI�Ƃ��Ă���B,,"https://www.city.higashiyamato.lg.jp/index.cfm/33,94383,345,599,html",,207-0032,,,,1,"�琬���F���z4,500�~�A�ԐH��F���z1,500�~","�����琬���F���z2,500�~�A1�����p500�~�A�琬�����A�ԐH��̌��Ɛ��x����B",1,�����F1.�s���ɋ��Z���Ă��菬�w�Z�ɏA�w���Ă��鎙���@2.�S�g�ɏ�Q��L���鎙���ɂ��Ắu���̎蒠�v3�x�Ⴕ����4�x�܂��́u�g�̏�Q�Ҏ蒠�v5������7���܂ł̎����A�܂��́A�����Ɠ����x�ƔF�߂��鎙���ŏW�c�������c�ނ��Ƃ��ł��A���A���͂Œʏ����邱�Ƃ��ł��鎙���B�@�ی�ҁF�J���E���a�E��Q�E�ЊQ�E���E�o�Y�E�A�w���̗��R�ɂ��A���ԉƒ�ɂ����Ă��q����̓K�؂ȊČ�ɓ�����Ȃ��ꍇ�ɑΏۂƂȂ�B�J���ɂ��ꍇ�Ƃ́A����13���ȏ��1��������4���Ԉȏ�̘J�������Ă���ꍇ�������B���玙�x�ƒ��́A�������悤�Ƃ��錎�̗����̏����܂łɕ��E����ꍇ�Ɍ���B,,,,,,2020-02-17
132209,0000000025,�����s,����a�s,�w���ۈ珊��\�N���u,�K�N�h�E�z�C�N�V���_�C�W���E�N���u,,1404a,����a�s��k��Q�|�W�U�T�|�X,,35.742882,139.414742,042-565-1900,,,,���ΐ��؋��y,,19:00,����a�s�����w�Z�̎��Ɠ��F���Z������B����a�s�����w�Z�̋x�Ɠ��i�y�j���y�ђ����x�Ɠ��A�U�֋x���j�F�ߑO�W������B�ߌ�6������ߌ�7���͉����ۈ�B�j���A12/29�`1/3�͏I�����p�s�B,���ی�ɂ����ĕی�҂̎d����a�C���̗��R�ɂ���ĕی�҂̓K�؂ȊČ���󂯂��Ȃ����w�Z�ɏA�w���Ă��鎙���̈��S�m�ۋy�ь��S�琬��}�邱�Ƃ�ړI�Ƃ��Ă���B,,"https://www.city.higashiyamato.lg.jp/index.cfm/33,94383,345,599,html",,207-0023,�����s�s���m���[���u��k��v�w�k���P�O��/���傱�o�X�u��k��c�n���v���ԓk���Q��,,,1,"�琬���F���z4,500�~�A�ԐH��F���z1,500�~","�����琬���F���z2,500�~�A1�����p500�~�A�琬�����A�ԐH��̌��Ɛ��x����B",1,�����F1.�s���ɋ��Z���Ă��菬�w�Z�ɏA�w���Ă��鎙���@2.�S�g�ɏ�Q��L���鎙���ɂ��Ắu���̎蒠�v3�x�Ⴕ����4�x�܂��́u�g�̏�Q�Ҏ蒠�v5������7���܂ł̎����A�܂��́A�����Ɠ����x�ƔF�߂��鎙���ŏW�c�������c�ނ��Ƃ��ł��A���A���͂Œʏ����邱�Ƃ��ł��鎙���B�@�ی�ҁF�J���E���a�E��Q�E�ЊQ�E���E�o�Y�E�A�w���̗��R�ɂ��A���ԉƒ�ɂ����Ă��q����̓K�؂ȊČ�ɓ�����Ȃ��ꍇ�ɑΏۂƂȂ�B�J���ɂ��ꍇ�Ƃ́A����13���ȏ��1��������4���Ԉȏ�̘J�������Ă���ꍇ�������B���玙�x�ƒ��́A�������悤�Ƃ��錎�̗����̏����܂łɕ��E����ꍇ�Ɍ���B,,,,,,2020-02-17
132209,0000000026,�����s,����a�s,�w���ۈ珊�����u�N���u,�K�N�h�E�z�C�N�V���T�N���K�I�J�N���u,,1404a,����a�s�����u�Q�|�Q�Q�Q�|�P�P,,35.735159,139.419503,042-562-7725,,,,���ΐ��؋��y,,19:00,����a�s�����w�Z�̎��Ɠ��F���Z������B����a�s�����w�Z�̋x�Ɠ��i�y�j���y�ђ����x�Ɠ��A�U�֋x���j�F�ߑO�W������B�ߌ�6������ߌ�7���͉����ۈ�B�j���A12/29�`1/3�͏I�����p�s�B,���ی�ɂ����ĕی�҂̎d����a�C���̗��R�ɂ���ĕی�҂̓K�؂ȊČ���󂯂��Ȃ����w�Z�ɏA�w���Ă��鎙���̈��S�m�ۋy�ь��S�琬��}�邱�Ƃ�ړI�Ƃ��Ă���B,,"https://www.city.higashiyamato.lg.jp/index.cfm/33,94383,345,599,html",,207-0022,,,,1,"�琬���F���z4,500�~�A�ԐH��F���z1,500�~","�����琬���F���z2,500�~�A1�����p500�~�A�琬�����A�ԐH��̌��Ɛ��x����B",1,�����F1.�s���ɋ��Z���Ă��菬�w�Z�ɏA�w���Ă��鎙���@2.�S�g�ɏ�Q��L���鎙���ɂ��Ắu���̎蒠�v3�x�Ⴕ����4�x�܂��́u�g�̏�Q�Ҏ蒠�v5������7���܂ł̎����A�܂��́A�����Ɠ����x�ƔF�߂��鎙���ŏW�c�������c�ނ��Ƃ��ł��A���A���͂Œʏ����邱�Ƃ��ł��鎙���B�@�ی�ҁF�J���E���a�E��Q�E�ЊQ�E���E�o�Y�E�A�w���̗��R�ɂ��A���ԉƒ�ɂ����Ă��q����̓K�؂ȊČ�ɓ�����Ȃ��ꍇ�ɑΏۂƂȂ�B�J���ɂ��ꍇ�Ƃ́A����13���ȏ��1��������4���Ԉȏ�̘J�������Ă���ꍇ�������B���玙�x�ƒ��́A�������悤�Ƃ��錎�̗����̏����܂łɕ��E����ꍇ�Ɍ���B,,,,,,2020-02-17